{"text_format":"1","workbook":"xlsx","n_sheets":8,"sheets":["Introduction","Information sheet","Scoping","Vulnerability assessment","Vulnerability results","Control Template","Resources","Report"],"not_rendered":{"charts":3,"images":3,"macros":1,"external_links":1,"defined_names":9,"comments":0,"pivot_tables":0},"unopened":[],"bounds":{"document_bytes":16777216,"sheet_cells":100000,"rows_first":2000,"rows_last":500,"rows_between":2000,"halvings":0,"cell_chars":16384,"cell_head_chars":4096},"cells_cut":0,"cells_raw":0,"read":"whole","date_system":"1900"}

{"sheet":"Introduction","index":0,"n_rows":11,"n_cols":2,"rows_kept":11,"cut":false,"hidden":false,"merged":[[9,1,9,4],[10,1,10,4],[1,1,1,4],[3,1,3,4],[5,1,5,4],[6,1,6,4],[7,1,7,4],[8,1,8,4]]}
[]
[null,"Introduction"]
[]
[null,"The FAMI-QS vulnerability assessment template Version 5, 18 June 2021 supports Operators in conducting the vulnerability assessment as described in Chapter 6 of the FAMI-QS Code of Practice (Feed Fraud Prevention and Defence Module). The use of this template is a mandatory requirement developed to support Operators in the process of managing feed fraud risk. Operators with a vulnerability assessment already in place can continue to use their own templates ensuring that the present elements have been incorporated in their own.\n\nThe sections must be executed in a successive order. You can easily move accross all sections with the use of the navigation buttons (arrows).\n\nThis template contains 6 sections:"]
[]
[1,"Information sheet: includes questions for informational purposes as well as information on the Operator's team conducting the vulnerability assessment"]
[2,"Scoping: includes questions to assist the Operator in performing the initial scoping of the vulnerability assessment"]
[3,"Vulnerability assessment: includes the vulnerability assessment to be performed by the Operator based on the scope identified in the scoping section"]
[4,"Vulnerability results: includes the result of the vulnerability assessment based on the Operator's setting of the risk appetite"]
[5,"Control template: includes an overview of all treated vulnerabilities in order to  define the controls to be implemented that should reduce the risks to an acceptable level. Such can include CCPs, CPs or more preventive controls. The control template holds a report generator to create a summary report of the vulnerability assessment "]
[6,"Resources: includes a list of resources that can guide the Operator in answering the questions in the vulnerability assessment"]

{"sheet":"Information sheet","index":1,"n_rows":26,"n_cols":4,"rows_kept":26,"cut":false,"hidden":false,"merged":[[2,1,2,3],[12,1,12,2]]}
[null,null,null,{"$f":"\"Version \"&'Information sheet'!C11","v":"Version "}]
[null,null,null,{"$f":"'Information sheet'!C10","v":"00:00:00"}]
[null,"Information sheet"]
[]
[]
[null,"Company details"]
[null,"Company Name:"]
[null,"Business Unit:"]
[null,"Location:"]
[null,"Date:"]
[null,"Version:"]
[]
[null,"Feed Fraud Vulnerability Assessment Team"]
[null,"'Team' is a virtual term. Changes to the team may occur after completion of the scoping. "]
[]
[null," ","Name","Job Title"]
[null,"Team leader:"]
[null,"Team member:"]
[null,"Team member:"]
[null,"Team member:"]
{"$rows_left_out":7}
{"sheet":"Scoping","index":2,"n_rows":38,"n_cols":5,"rows_kept":38,"cut":false,"hidden":false,"merged":[[37,1,37,3],[38,1,38,3],[35,1,35,3],[23,1,23,3],[26,1,26,3],[29,1,29,3],[34,1,34,3],[4,1,8,3],[20,1,20,3],[14,1,14,3],[17,1,17,3],[32,1,32,3],[28,1,28,3],[25,1,25,3],[22,1,22,3],[19,1,19,3],[31,1,31,3],[16,1,16,3]]}
[null,null,null,null,{"$f":"\"Version \"&'Information sheet'!C11","v":"Version "}]
[null,null,null,null,{"$f":"'Information sheet'!C10","v":"00:00:00"}]
[null,"FAMI-QS Code of Practice - Feed Fraud Prevention and Defence Module - Version 1.0"]
[]
[null,"Chapter 6.1.2. 'Scope of the feed fraud prevention system' of the FAMI-QS Code of Practice describes that Operators must determine the scope of their feed fraud prevention system by conducting an initial assessment.\n\nThe below scoping questions will provide guidance to the Operators in order to conclude on which level within the company the feed fraud vulnerability assessment should be performed. This template is intended to support the Operator in defining a scope that allows for effective vulnerability assessment.\n\nBy answering the 9 scoping questions, an Operator should be able to determine a scope that allows for performing a (targeted) vulnerability assessment. This scope should  be defined in cell B36. The Operator may decide to define several scopes leading to multiple vulnerability assessments. The additional scopes can be defined in cell B39 and serve as input to a new vulnerability assessment. Operators defining additional scopes are expected to plan for execution of additional assessments."]
[]
[]
[]
[]
[]
[null,"Instructions"]
[null,"Please answer the below scoping questions (based on the results of scoping, the operator may consider updating the team before starting the vulnerability assessment)."]
[]
[null,"Which geography/business unit/product line/sites/sections of the company handle the feed products with the highest economical value?"]
[]
[]
[null,"Which geography/business unit/product line/sites/sections of the company handle the feed products which are subject to price volatility (the degree of variation of a trading price series over time)? "]
[]
[]
[null,"Which geography/business unit/product line/sites/sections of the company handle the feed products which are dependent on a high number of suppliers or are sourced from a complex supply chain (with multiple tiers and/or actors)?"]
{"$rows_left_out":19}
{"sheet":"Vulnerability assessment","index":3,"n_rows":41,"n_cols":10,"rows_kept":41,"cut":false,"hidden":false,"merged":[[5,2,9,6],[11,3,13,6]]}
[null,null,null,null,null,null,null,null,{"$f":"\"Version \"&'Information sheet'!C11","v":"Version "}]
[null,null,"Vulnerability assessment",null,null,null,null,null,{"$f":"'Information sheet'!C10","v":"00:00:00"}]
[]
[null,null,"FAMI-QS Code of Practice - Feed Fraud Prevention and Defence Module - Version 1.0"]
[]
[null,null,"Chapter 6.1.3 'Performing vulnerability assessments' of the FAMI-QS Code of Practice describes that Operators must conduct a feed fraud vulnerability assessment based on the scope defined in chapter 6.1.2. and document the results.\n\nThe Vulnerability Assessment approach must address the opportunities for feed fraud, motivations that fraudsters may have and consider the controls that may already exist in order to determine the current ‘vulnerability to feed fraud’ status. The approach must consider the scope of the feed fraud prevention system as defined in the scoping section of this template in order to apply the appropriate level of detail to the vulnerability assessment. This FAMI-QS template will support Operators in complying with the requirements of chapter 6.1.3."]
[]
[]
[]
[]
[]
[null,null,null,"Note that the decision to 'treat' identified opportunities, motivations or controls needs to be made after the vulnerability results have been analysed. When analysis is completed, the template will require operators to navigate back to the vulnerability assessment section using the button \"Back to Vulnerability Assessment to decide which fraud risk to treat\". Once this button is pressed, a yes/no treatment column appears in column J of this section"]
[]
[]
[]
[null,null,"Instructions"]
[null,null,"Considering the scope defined in the scoping section, please answer which option best describes the vulnerability for each category. Use the justification section to provide arguments why the chosen option applies."]
[]
["In scope (hidden column)",null,"Category","Question","Option 1","Option 2","Option 3","Answer","Justification","Treatment"]
[null,null,"Opportunity","1. How simple or complex is it to adulterate your raw materials / ingredients?","• Cannot be modified, products can only be replaced\n• Technologies / methods are not available or known\n• Simple and straightforward to check alteration of raw materials/ ingredients e.g. visual inspection, smelling","• Can be modified by mixing low-quality or foreign material e.g. powders\n• Advanced technologies, methods, facilities and knowledge are required to adulterate \n• Established on-site methods are available for fraud screening (e.g. test kits) but confirmation of adulteration requires additional testing","• Can be modified by mixing low-quality or foreign material e.g. powders\n• Can be modified by altering valuable feed components\n• Basic technologies, knowledge and methods are available, with no specialist facilities required to adulterate the raw materials/ ingredients\n• Detection and confirmation requires advanced laboratory analysis, or testing for adulteration is not available at all",null,null,"No"]
{"$rows_left_out":22}
{"sheet":"Vulnerability results","index":4,"n_rows":34,"n_cols":20,"rows_kept":34,"cut":false,"hidden":false,"merged":[[4,1,7,15],[18,1,18,15],[30,1,31,15],[33,1,34,15]]}
[null,null,null,null,null,null,null,null,null,{"$f":"\"Version \"&'Information sheet'!C11","v":"Version "}]
[null,"Vulnerability assessment score overview",null,null,null,null,null,null,null,{"$f":"'Information sheet'!C10","v":"00:00:00"}]
[null,null,null,null,null,null,null,null,null,null,null,null,null,null,null,null,{"$f":"C25/100","v":0.5},null,"Low",{"$f":"Q3/2","v":0.25}]
[null,"FAMI-QS Code of Practice - Feed Fraud Prevention and Defence Module - Version 1.0"]
[null,"Chapter '6.1.4 - Analysing risk and defining boundaries' of the FAMI-QS Code of Practice describes that Operators must analyse the output of the vulnerability assessment, document the outcome of the analysis and decide on priorities, based on an evaluation of the level of vulnerability associated with each object of focus. The Operator must set risk boundaries, depending on the levels of vulnerability that are acceptable and unacceptable for the operation. Such boundaries can be set by defining the Operator's risk appetite. Setting the operators risk appetite leads to an overall need to take action. The overall need to take action is determined based on the average score of the vulnerability assessment and the set risk appetite. This FAMI-QS template will support Operators in conducting the requirements of chapter 6.1.4."]
[]
[]
[null,null,null,null,null,null,null,null,null,null,null,null,null,null,null,null,null,null,"Medium",{"$f":"Q3","v":0.5}]
[]
[null,"Results of Vulnerability Assessment"]
[]
[null,"Category","Score",null,null,null,null,null,null,null,null,null,null,null,null,null,null,null,"High",{"$f":"(1-Q3)/2+Q3","v":0.75}]
[null,"Opportunity",{"$f":"(SUMIFS('Vulnerability assessment'!$H$20:$H$41,'Vulnerability assessment'!$C$20:$C$41,'Vulnerability results'!B13)-COUNTIFS('Vulnerability assessment'!$C$20:$C$41,'Vulnerability results'!B13))/COUNTIFS('Vulnerability assessment'!$C$20:$C$41,'Vulnerability results'!B13)/2","v":-0.5},null,null,null,null,null,null,null,null,null,null,null,null,null,null,null,"Very high",1]
[null,"Motivations",{"$f":"(SUMIFS('Vulnerability assessment'!$H$20:$H$41,'Vulnerability assessment'!$C$20:$C$41,'Vulnerability results'!B14)-COUNTIFS('Vulnerability assessment'!$C$20:$C$41,'Vulnerability results'!B14))/COUNTIFS('Vulnerability assessment'!$C$20:$C$41,'Vulnerability results'!B14)/2","v":-0.5}]
[null,"Controls",{"$f":"(SUMIFS('Vulnerability assessment'!$H$20:$H$41,'Vulnerability assessment'!$C$20:$C$41,'Vulnerability results'!B15)-COUNTIFS('Vulnerability assessment'!$C$20:$C$41,'Vulnerability results'!B15))/COUNTIFS('Vulnerability assessment'!$C$20:$C$41,'Vulnerability results'!B15)/2","v":-0.5}]
[null,"Overall",{"$f":"SUM(C13:C15)/3","v":-0.5}]
[]
[null,"Instructions"]
[null,"1. Determine the organisation's risk appetite: The risk appetite that can be indicated on the below slider is the level of risk, on a broad scale, an Operator is willing to accept in pursuit of reducing fraud risks to an acceptable level. It reflects the risk management philosophy of the Operator and may influence the allocation of resources. Risk appetite helps the Operator in guiding the organisation, the employees and the processes in designing the necessary infrastructure to effectively respond to feed fraud risks and to monitor them. Note that setting the risk appetite is not the result of an exact score, but rather the assessment of how the operators risk appetite variers between very low and very high."]
[]
{"$rows_left_out":15}
{"sheet":"Control Template","index":5,"n_rows":57,"n_cols":18,"rows_kept":57,"cut":false,"hidden":false,"merged":[[17,6,17,11],[17,2,17,5],[17,12,17,14],[17,15,17,17],[4,2,6,7],[9,2,9,7]]}
[null,null,null,null,null,null,null,null,null,null,null,null,null,null,null,null,{"$f":"\"Version \"&'Information sheet'!C11","v":"Version "}]
[null,null,"Vulnerability Control Point Identification",null,null,null,null,null,null,null,null,null,null,null,null,null,{"$f":"'Information sheet'!C10","v":"00:00:00"}]
[]
[null,null,"FAMI-QS Code of Practice - Feed Fraud Prevention and Defence Module - Version 1.0"]
[null,null,"Chapter '6.1.5 - Defining critical control points' of the FAMI-QS Code of Practice describes that Operators must define a set of preventive actions and controls to reduce the vulnerabilities to an acceptable level. Based on the controls identified, a mitigation plan based on CCP’s must be developed. This FAMI-QS template will support Operators in conducting the requirements of chapter 6.1.5."]
[]
[]
[]
[null,null,"Instructions:"]
[null,null,"Indicate in column J ('Treatment') of the Vulnerability assessment tab if all vulnerabilities have been analysed and either marked with a yes or no. The fraud risks where a 'yes' is indicated have been automatically added to the table below for documentation on further actions, based on the following steps:"]
[null,null,"1. Identify the feed fraud vulnerabilities from the Vulnerability assessment (automatically added)"]
[null,null,"2. Describe the control measures (risk mitigation measures) to reduce fraud risk, also consider legal requirements"]
[null,null,"3. Where applicable set at least one critical control limit for each control, also consider legal limit requirements and identify supporting documentation"]
[null,null,"4. Define monitoring procedures for each control including frequency, responsibilities and relevant documentation necessary to perform the monitoring procedures"]
[null,null,"5. Define anticipated corrective actions for each control outside of control limits including responsibilities and record keeping"]
[null,null,"6. Validate approach before implementation and verify effective implementation"]
[]
[null,null,"Vulnerability assessment",null,null,null,"Monitoring/Control Plan",null,null,null,null,null,"Corrective action plan",null,null,"Verification and validation"]
[null,null,"1. Feed Vulnerability Category","1. Feed Vulnerability Topic","1. Feed Vulnerability Score","1. Justification","2. Control Measures","3. Critical limit (where applicable)","4. Control monitoring procedure","4. Frequency of monitoring","4. RACI (responsible/accountable/ consulted/informed) for monitoring","4. Documentation","5. Corrective action procedure","5. RACI (responsible/accountable/ consulted/informed) for monitoring","5. Documentation","Verified","Validated","Date"]
[1,null,{"$f":"IFERROR(INDEX(Table3[Category],SMALL(IF(Table3[Treatment]=\"Yes\",ROW(Table3[Treatment])-ROW(INDEX(Table3[Treatment],1,1))+1),'Control Template'!A20)),0)","v":0},{"$f":"IFERROR(INDEX(Table3[Question],SMALL(IF(Table3[Treatment]=\"Yes\",ROW(Table3[Treatment])-ROW(INDEX(Table3[Treatment],1,1))+1),'Control Template'!A20)),0)","v":0},{"$f":"IFERROR(INDEX(Table3[Answer],SMALL(IF(Table3[Treatment]=\"Yes\",ROW(Table3[Treatment])-ROW(INDEX(Table3[Treatment],1,1))+1),'Control Template'!A20)),0)","v":0},{"$f":"IFERROR(INDEX(Table3[Justification],SMALL(IF(Table3[Treatment]=\"Yes\",ROW(Table3[Treatment])-ROW(INDEX(Table3[Treatment],1,1))+1),'Control Template'!A20)),0)","v":0}]
{"$rows_left_out":38}
{"sheet":"Resources","index":6,"n_rows":15,"n_cols":3,"rows_kept":15,"cut":false,"hidden":false,"merged":[[2,1,2,13],[6,1,8,1],[13,1,14,1]]}
[]
[null,"Resources\n"]
[null,"Below list of resources can provide guidance when answering the questions of the vulnerability assessment:"]
[]
[]
[null,"Can provide guidance in answering questions:","Link to resources:"]
[null,"Opportunities ǀ questions 1 & 3 & 6","https://www.foodshield.org/tools.cfm"]
[null,null,"https://decernis.com/"]
[null,null,"https://ec.europa.eu/food/safety/rasff_en"]
[null,"Motivations ǀ question 7","e.g. http://www.indexmundi.com/commodities/?commodity=cocoa-beans"]
[null,"Motivations ǀ question 9","http://www.transparency.org"]
[null,"Motivations ǀ question 10","Annual reports of suppliers, company financial reports"]
[null,"Motivations ǀ question 11","https://www.indexmundi.com/commodities/?commodity=sugar "]
[null,"Transparency Index\nOperators should answer question 9 (motivations) by looking at the ranking on the index, not the score. E.g., New Zealand ranks 1 with a score of 88 in the 2020 index, Somalia ranks 179 with a score of 12 in the 2020 index).","https://www.transparency.org/en/cpi/2020/index/prk "]
[null,null,"The above link to the Transparency Index will be updated annually"]

{"sheet":"Report","index":7,"n_rows":4,"n_cols":3,"rows_kept":4,"cut":false,"hidden":true,"merged":[]}
[]
[null,"Company Report Name:",{"$f":"'Information sheet'!$C$7","v":0}]
[]
[null,{"$f":"TODAY()","v":"2023-01-31"}]